{"text_format":"1","workbook":"xlsx","n_sheets":6,"sheets":["Read me - LAs","Level 1 Screening","Sheet1","Raw Areas","Calculations","Sites"],"not_rendered":{"charts":0,"images":2,"macros":1,"external_links":0,"defined_names":4,"comments":2,"pivot_tables":0},"unopened":[],"bounds":{"document_bytes":16777216,"sheet_cells":100000,"rows_first":2000,"rows_last":500,"rows_between":2000,"halvings":0,"cell_chars":16384,"cell_head_chars":4096},"cells_cut":0,"cells_raw":0,"read":"whole","date_system":"1900"}

{"sheet":"Read me - LAs","index":0,"n_rows":21,"n_cols":3,"rows_kept":21,"cut":false,"hidden":false,"merged":[]}
[]
[]
[]
[]
[]
[]
[]
[null,null,"JBA Strategic Flood Risk Assessment Site Screening Tool - v1.0"]
[]
[null,null,"This spreadsheet has been designed to assist local authorities with the selection of development sites for inclusion within their local plan."]
[]
[null,null,"Note on calculations:"]
[null,null,"Site boundaries have been screened against flood risk information to determine the proportion of the site at risk.  The following flood risk information has been used in the assessment\n●  Flood Zones (from Environment Agency Flood Zones and results from detailed hydraulic models). Due to a lack of available information for the 3.3% AEP, Flood Zone 3 is represented by a 2%   AEP event from the detailed hydraulic model.\n●  Surface Water (from the updated Flood Map for Surface Water)\n●  Environment Agency's Historic Flood Map\n●  Reservoirs (from the Environment Agency Reservoir Flood Maps)"]
[]
[null,null,"Additional information:"]
[null,null,"The sites have also been considered against the following information to provide additional information to support decision making\n●  Canal centrelines - to determine if there is a canal within 100m of the site\n●  Environment Agency's Areas Benefitting from Defences dataset - to determine if the site benefits from formal flood defences\n●  Detailed River Network dataset - to determine if there is a watercourse with a catchment less than 3km2 flowing through or adjacent to a site, which would not have been included in the Environment Agency's Flood Zones\n●  Whether any additional modelling is required to determine Flood Zones for the Level 2 Strategic Flood Risk Assessment"]
[]
[null,null,"Note on Flood Zone and Surface Water percentages:"]
[null,null,"The values quoted in the Level 1 Screening tab show the percentage of the site at flood risk from that particular Flood Zone / event, excluding the percentage of the site at flood risk at a higher zone.  \n\nFor example\n50% of a site is in the Flood Zones.  Taking each Flood Zone individually, 50% is in Flood Zone 2 but only 30% is in Flood Zone 3a and only 10% is in Flood Zone 3b.\nIn the Level 1 Screening tab this will be displayed as 10% in Flood Zone 3b, 20% in Flood Zone 3a (as this excludes the 10% in Flood Zone 3b), 20% in Flood Zone 2 (as this excludes the 10% in Flood Zone 3b and 20% in Flood Zone 3a) and 50% in Flood Zone 1."]
[]
[null,null,"Using the spreadsheet"]

{"sheet":"Level 1 Screening","index":1,"n_rows":41,"n_cols":36,"rows_kept":41,"cut":false,"hidden":false,"merged":[[1,33,1,35],[1,19,1,24],[1,31,1,32],[0,2,0,32],[1,2,1,4],[1,29,1,30],[0,1,1,1],[0,0,1,0],[1,27,1,28],[1,16,1,18],[1,25,1,26],[1,6,1,15]]}
["Site Name","Area (ha)","Proportion of site shown to be at risk (%)"]
[null,null,"Flood Map for Planning Flood Zones",null,null,"SFRA Flood Zones","Fluvial and Tidal Flood Risk plus climate change",null,null,null,null,null,null,null,null,null,"Environment Agency Risk of Flooding from Surface Water",null,null,"Environment Agency Risk of Flooding from Surface Water plus climate change",null,null,null,null,null,"Environment Agency Reservoir Flood Extent",null,"JBA Groundwater Flood Risk Dataset",null,"Historic Flooding",null,"Tidally influenced",null,"Risk Category"]
[null,null,"FZ1","FZ2","FZ3a","FZ3b","3.3%AEP plus Central","3.3%AEP and 0.5% plus Higher Central","3.3%AEP and 0.5% plus Upper End","1%AEP plus Central","1%AEP and 0.5% plus Higher Central","1%AEP and 0.5% plus Upper End","0.1%AEP plus Central","0.1%AEP and 0.5% plus Higher Central","0.1%AEP and 0.5% plus Upper End","Flood Zone 2 as proxy where no detailed model available","30 year","100 year","1000 year ","3.3%AEP+20%","3.3%AEP +40%","1%AEP+25%","1%AEP +45%","0.1%AEP+25%","0.1%AEP +45%","Dry Day","Wet day","0- 0.025m\n(grid code 4)","0.025- 0.05m\n(grid code 3)","EA Historic Flood Map","West Sussex (within 50m of)","Tidally influenced Drainage Risk Zone (maximum risk)\n","Tidally influenced Groundwater Risk Zone (maximum risk)","Fluvial and Tidal Flood Risk plus climate change (Higher Central)","Environment Agency Risk of Flooding from Surface Water plus climate change","Greatest risk"]
["5 Brighton Road",0.503,7.086150153172821E-3,3.1283702225236687E-2,0.27002327504312529,0.6916068725784652,0,1.0005005262100477,1.0005005262100477,0,1.0005005262100477,1.0005005262100477,0,1.0005005262100477,1.0005005262100477,0,0,0,0,0,0,2.7456262424795626E-3,2.7456262424795626E-3,2.0249351104360238E-2,8.2989056901766806E-2,0,0,7.7285785283560046E-3,0,0,0,3,2,{"$f":"_xlfn.IFS(K4>0.005,\"High\",N4>0.005,\"Medium\",N4<=0.005,\"Low\")","v":"High"},{"$f":"_xlfn.IFS(W4>0.005,\"High\",Y4>0.005,\"Medium\", Y4<=0.005,\"Low\")","v":"Medium"},{"$f":"IF(COUNTIF(AH4:AI4,\"high\"),\"High\",IF(COUNTIF(AH4:AI4,\"medium\"),\"Medium\",\"Low\"))","v":"High"}]
["77A Brighton Road",5.3999999999999999E-2,-3.3861538737351982E-3,5.8416625755933316E-2,0.30747045680660923,0.63749907131119266,0,1.0033861538737352,1.0033861538737352,0,1.0033861538737352,1.0033861538737352,0,1.0033861538737352,1.0033861538737352,0,0,0,0,0,0,0,0,0.15356098550675018,0.16475190139002777,0,0,0,0,0,0,2,2,{"$f":"_xlfn.IFS(K5>0.005,\"High\",N5>0.005,\"Medium\",N5<=0.005,\"Low\")","v":"High"},{"$f":"_xlfn.IFS(W5>0.005,\"High\",Y5>0.005,\"Medium\", Y5<=0.005,\"Low\")","v":"Medium"},{"$f":"IF(COUNTIF(AH5:AI5,\"high\"),\"High\",IF(COUNTIF(AH5:AI5,\"medium\"),\"Medium\",\"Low\"))","v":"High"}]
["B&Q and Halfords",1.2989999999999999,1,0,0,0,0,0.2522367326740485,0.52540629119544813,0,0.57166492284216319,0.85812703485549657,0,0.78946324937192458,0.96264108440632024,0,3.3577660443806622E-3,5.1153296699998534E-3,3.32920692510301E-2,2.352075605319207E-3,2.352075605319207E-3,3.2984140074740646E-2,3.8590994694110779E-2,0.10123129295597691,0.12112538912201541,0,0,0,0.70921371865926186,0,0,3,2,{"$f":"_xlfn.IFS(K6>0.005,\"High\",N6>0.005,\"Medium\",N6<=0.005,\"Low\")","v":"High"},{"$f":"_xlfn.IFS(W6>0.005,\"High\",Y6>0.005,\"Medium\", Y6<=0.005,\"Low\")","v":"High"},"High"]
["Car Park, Beach Green, Shoreham-by-Sea",0.95599999999999996,4.0303075740787217E-4,1.2902005852577503E-17,0.99897669123535693,6.2027800723517366E-4,0,6.2027800723517366E-4,0.999596969242592,0,0.999596969242592,0.999596969242592,0,0.999596969242592,0.999596969242592,0,0,5.2871213303858369E-6,0.11474242811104396,0,0,0.11853154962931275,0.19330444177061298,0.63140170706194776,0.74106776531982543,0,0,0,0,0,0,3,2,{"$f":"_xlfn.IFS(K7>0.005,\"High\",N7>0.005,\"Medium\",N7<=0.005,\"Low\")","v":"High"},{"$f":"_xlfn.IFS(W7>0.005,\"High\",Y7>0.005,\"Medium\", Y7<=0.005,\"Low\")","v":"High"},"High"]
["Car Park, Tarmount Lane, Shoreham-by-Sea",0.16500000000000001,1,0,0,0,0,0,0,0,0,0,0,0,0,0,0,0,1.8102485488707818E-4,0,0,1.8102485488707818E-4,1.8102485488707818E-4,7.9217385053975145E-2,0.10170534392422788,0,0,0,0,0,0,0,0,{"$f":"_xlfn.IFS(K8>0.005,\"High\",N8>0.005,\"Medium\",N8<=0.005,\"Low\")","v":"Low"},{"$f":"_xlfn.IFS(W8>0.005,\"High\",Y8>0.005,\"Medium\", Y8<=0.005,\"Low\")","v":"Medium"},"Medium"]
["Community Buildings, Pond Road, Shoreham-by-Sea",0.59,1,0,0,0,0,0,0,0,0,0.39556964437284575,0,1.3911375782178559E-3,0.75722386770555083,0,0,0,0.14964431509355272,0,0,0.14896634899185782,0.16516211454772492,0.2900254308234203,0.32233905387453055,0,0,0,0,0,0,0,0,{"$f":"_xlfn.IFS(K9>0.005,\"High\",N9>0.005,\"Medium\",N9<=0.005,\"Low\")","v":"Low"},{"$f":"_xlfn.IFS(W9>0.005,\"High\",Y9>0.005,\"Medium\", Y9<=0.005,\"Low\")","v":"High"},"High"]
["Co-op Ham Road",0.57699999999999996,1,0,0,0,0,0,7.3667100244071762E-3,0,1.5172728893933762E-2,0.13730394470601853,0,7.9962572986870192E-2,0.32773267904154246,0,0,0,2.5586327725276609E-2,0,0,2.4040194491709015E-2,3.3490445919050087E-2,7.0890480728896199E-2,8.3425406644998104E-2,0,0,0,0,0,0,2,1,{"$f":"_xlfn.IFS(K10>0.005,\"High\",N10>0.005,\"Medium\",N10<=0.005,\"Low\")","v":"High"},{"$f":"_xlfn.IFS(W10>0.005,\"High\",Y10>0.005,\"Medium\", Y10<=0.005,\"Low\")","v":"High"},"High"]
["Eastbrook Allotments, Old Shoreham Road, Southwick",4.18,1,0,0,0,0,0,0,0,0,0,0,0,0,0,0,0,1.5194736438179212E-2,0,0,1.4142104859231867E-2,3.2944200553013163E-2,9.5630601219363648E-2,0.12614119273715288,0,0,0,0.32862317805721053,0,0,0,0,{"$f":"_xlfn.IFS(K11>0.005,\"High\",N11>0.005,\"Medium\",N11<=0.005,\"Low\")","v":"Low"},{"$f":"_xlfn.IFS(W11>0.005,\"High\",Y11>0.005,\"Medium\", Y11<=0.005,\"Low\")","v":"High"},"High"]
["Egypt Wharf / Lennards Wharf",2.6230000000000002,0.31974547665531056,0.14871260219044991,0.30112324107071603,0.23041868008352345,0,0.89261296008998459,0.94494388527933659,0,0.92823512500221106,0.95849385166270684,0,0.94959204215589021,0.9686286630317118,0,0,4.8353885813008389E-2,0.12380665303995729,3.8722911748232938E-3,4.2454067766512386E-2,0.122739173055207,0.13592160535799161,0.20282818993106363,0.2732407559962417,0,0,0,0,0,0,4,2,{"$f":"_xlfn.IFS(K12>0.005,\"High\",N12>0.005,\"Medium\",N12<=0.005,\"Low\")","v":"High"},{"$f":"_xlfn.IFS(W12>0.005,\"High\",Y12>0.005,\"Medium\", Y12<=0.005,\"Low\")","v":"High"},"High"]
["Fishermans Wharf",0.995,0.5699538083049086,7.3147041770602939E-2,0.3478913509818331,9.0077989426553557E-3,0,0.95268628062968741,0.96682914887434068,0,0.99954698400296582,0.99954698400296582,0,0.99954698400296582,0.99954698400296582,0,0,0,2.5662322924510053E-2,0,0,2.566232292451005E-2,3.6591709859065728E-2,0.11529752820635175,0.15355879249642915,0,0,0,0,0,0,2,1,{"$f":"_xlfn.IFS(K13>0.005,\"High\",N13>0.005,\"Medium\",N13<=0.005,\"Low\")","v":"High"},{"$f":"_xlfn.IFS(W13>0.005,\"High\",Y13>0.005,\"Medium\", Y13<=0.005,\"Low\")","v":"High"},"High"]
["Free Wharf",1.571,0.15136285526447479,0.13820211342405486,0.71043503131147034,0,0,0,0,0,0.88734662487415017,0.89052931106129218,0,0.88893796796772129,0.8953033403420052,0,0,1.1712285168682368E-2,2.6484468691278681E-2,8.9115213239974542E-3,1.1203055378739658E-2,3.8409204825844173E-2,6.9606979659583706E-2,0.15003172806541248,0.25503793307322342,0,0,0,0,0,0,3,2,{"$f":"_xlfn.IFS(K14>0.005,\"High\",N14>0.005,\"Medium\",N14<=0.005,\"Low\")","v":"High"},{"$f":"_xlfn.IFS(W14>0.005,\"High\",Y14>0.005,\"Medium\", Y14<=0.005,\"Low\")","v":"High"},"High"]
["Frosts",0.747,1.0156981292007705E-3,8.4810298149050611E-3,0.99050327205589417,0,0,0,0,0,0.99898430187079923,0.99898430187079923,0,0.99898430187079923,0.99898430187079923,0,0,0,4.2177726193994777E-2,0,0,3.596370714441486E-2,0.11274032562930844,0.59496989676766932,0.62016153530122353,0,0,8.0965748413989441E-5,3.861385076224137E-3,0,0,3,4,{"$f":"_xlfn.IFS(K15>0.005,\"High\",N15>0.005,\"Medium\",N15<=0.005,\"Low\")","v":"High"},{"$f":"_xlfn.IFS(W15>0.005,\"High\",Y15>0.005,\"Medium\", Y15<=0.005,\"Low\")","v":"High"},"High"]
["Kingston Wharf",2.6150000000000002,0.33635929939404596,0.11425450179646268,0.54938619880949136,0,0,0,0,0,0.94724048015888718,0.95393264077074558,0,0.95010854899254293,0.95656170386825989,0,8.41300191204589E-3,3.2275334608030594E-2,8.6541549636481835E-2,1.7284894837476097E-2,2.9216061185468448E-2,8.440005824068833E-2,0.19057826308430706,0.35893352817404356,0.41590948213097889,0,0,7.8627822139577443E-3,1.0301720841038049E-2,0,0,4,4,{"$f":"_xlfn.IFS(K16>0.005,\"High\",N16>0.005,\"Medium\",N16<=0.005,\"Low\")","v":"High"},{"$f":"_xlfn.IFS(W16>0.005,\"High\",Y16>0.005,\"Medium\", Y16<=0.005,\"Low\")","v":"High"},"High"]
["Land at Eastbrook Primary School, Manor Hall Road, Southwick",0.70499999999999996,1,0,0,0,0,0,0,0,0,0,0,0,0,0,0,3.1205673758865252E-2,0.16121338043592909,2.4964539007092203E-2,3.0070921985815603E-2,0.15081877050703121,0.21488843691264539,0.38111796359441991,0.41348994941136602,0,0,0,0.99914889504286952,0,0,0,0,{"$f":"_xlfn.IFS(K17>0.005,\"High\",N17>0.005,\"Medium\",N17<=0.005,\"Low\")","v":"Low"},{"$f":"_xlfn.IFS(W17>0.005,\"High\",Y17>0.005,\"Medium\", Y17<=0.005,\"Low\")","v":"High"},"High"]
["Land at junction of Saltings Roundabout, New Salts Farm, New Salts Farm Road, Lancing",0.90700000000000003,6.289499568554735E-4,0,0.99937105004314453,0,0,0,0.55180860477450488,0,0.99937105004314442,0.99937105004314442,0,0.99937105004314442,0.99937105004314442,0,0,1.4731190738688203E-2,4.6011270003885343E-2,9.5698831311850155E-3,1.4429801543548179E-2,2.3979261768098347E-2,3.5423655835965705E-2,8.3054701240247067E-2,9.6843300622865489E-2,0,0,0,0,0,0,3,2,{"$f":"_xlfn.IFS(K18>0.005,\"High\",N18>0.005,\"Medium\",N18<=0.005,\"Low\")","v":"High"},{"$f":"_xlfn.IFS(W18>0.005,\"High\",Y18>0.005,\"Medium\", Y18<=0.005,\"Low\")","v":"High"},"High"]
["Land at Mill Hill, Shoreham-by-Sea",5.9160000000000004,1,0,0,0,0,0,0,0,0,0,0,0,0,0,0,0,0,0,0,0,8.7087506222234784E-4,1.7225946585929174E-3,6.7825147502200466E-3,0,0,0,0,0,0,0,0,{"$f":"_xlfn.IFS(K19>0.005,\"High\",N19>0.005,\"Medium\",N19<=0.005,\"Low\")","v":"Low"},{"$f":"_xlfn.IFS(W19>0.005,\"High\",Y19>0.005,\"Medium\", Y19<=0.005,\"Low\")","v":"Medium"},"Medium"]
["Land east of Manor Close",2.8319999999999999,3.3570090293422172E-4,0,0.99966429909706578,0,0,0,8.4680948936016603E-2,0,0.99966429909706567,0.99966429909706567,0,0.99966429909706567,0.99966429909706567,0,0.10171263669621823,0.37247924117710102,0.77447233623872536,0.18499763430556113,0.33153609324508088,0.77433109330087224,0.78883760467531783,0.84814144772580158,0.87524157275798731,0,0,0.99966429909706578,0,0.16533451952526415,0,4,4,{"$f":"_xlfn.IFS(K20>0.005,\"High\",N20>0.005,\"Medium\",N20<=0.005,\"Low\")","v":"High"},{"$f":"_xlfn.IFS(W20>0.005,\"High\",Y20>0.005,\"Medium\", Y20<=0.005,\"Low\")","v":"High"},"High"]
["Land east of Minstrels Gallery",3.1059999999999999,4.5337600900519082E-4,0,0.99954662399099481,0,0,9.6947781075879917E-3,0.89052702619668389,0,0.9995466239909917,0.9995466239909917,0,0.9995466239909917,0.9995466239909917,0,0,4.2212729487235354E-3,4.6893225820838699E-2,3.2195750160978753E-3,4.1559411363092406E-3,2.8162579723484581E-2,4.9815230848827753E-2,0.15377515711408565,0.21310825487412779,0,0,0.13132817011196105,8.5782640327326147E-4,1.2049718995348391E-2,0,3,4,{"$f":"_xlfn.IFS(K21>0.005,\"High\",N21>0.005,\"Medium\",N21<=0.005,\"Low\")","v":"High"},{"$f":"_xlfn.IFS(W21>0.005,\"High\",Y21>0.005,\"Medium\", Y21<=0.005,\"Low\")","v":"High"},"High"]
["Land east of, Adur Close, Lancing",0.189,2.2171575449363434E-3,0,0.99778284245506366,0,0,0,0.99778284245506343,0,0.99778284245506343,0.99778284245506343,0,0.99778284245506343,0.99778284245506343,0,0,0,0,0,0,0,0,3.5934416516594501E-3,3.7993069610363123E-3,0,0,0,0,0,0,2,2,{"$f":"_xlfn.IFS(K22>0.005,\"High\",N22>0.005,\"Medium\",N22<=0.005,\"Low\")","v":"High"},{"$f":"_xlfn.IFS(W22>0.005,\"High\",Y22>0.005,\"Medium\", Y22<=0.005,\"Low\")","v":"Low"},"High"]
["Land north of Hill Farm Way",0.24299999999999999,1,0,0,0,0,0,0,0,0,0,0,0,0,0,0,0,0,0,0,0,0,4.4899836897952265E-3,8.5683605087012754E-2,0,0,0,0,0,0,0,0,{"$f":"_xlfn.IFS(K23>0.005,\"High\",N23>0.005,\"Medium\",N23<=0.005,\"Low\")","v":"Low"},{"$f":"_xlfn.IFS(W23>0.005,\"High\",Y23>0.005,\"Medium\", Y23<=0.005,\"Low\")","v":"Medium"},"Medium"]
["Land north of Minstrels Gallery",1.016,4.824337963366121E-3,7.8494168836582556E-2,0.91668149320005132,0,0,0,0,0,0.99919632685862203,0.99919632685862203,0,0.99919632685862203,0.99919632685862203,0,0,0,1.8503937007874015E-2,0,0,0,1.0236220472440945E-2,3.0314960629921259E-2,3.6566702399574214E-2,0,0,0.13092569442224214,0.83056918023640258,0,0,2,4,{"$f":"_xlfn.IFS(K24>0.005,\"High\",N24>0.005,\"Medium\",N24<=0.005,\"Low\")","v":"High"},{"$f":"_xlfn.IFS(W24>0.005,\"High\",Y24>0.005,\"Medium\", Y24<=0.005,\"Low\")","v":"High"},"High"]
["Land north of Willowbrook Park",0.94799999999999995,8.380368322330467E-4,0,0.99916196316776695,0,0,0.18040283287847259,0.99916196316776695,0,0.99916196316776695,0.99916196316776695,0,0.99916196316776695,0.99916196316776695,0,9.4687869481607824E-3,0.13716304245655486,0.48770701498874369,4.8084179191436392E-2,0.11404252788248735,0.49339041614361923,0.53524637709099898,0.76007430715725532,0.82250028938705921,0,0,0,0,0,0,4,2,{"$f":"_xlfn.IFS(K25>0.005,\"High\",N25>0.005,\"Medium\",N25<=0.005,\"Low\")","v":"High"},{"$f":"_xlfn.IFS(W25>0.005,\"High\",Y25>0.005,\"Medium\", Y25<=0.005,\"Low\")","v":"High"},"High"]
["Land north west of West Avenue",7.27,4.8862404503424717E-4,0,0.99951137595496575,0,0,0.13320683052208529,0.92619794914451592,0,0.99951137595496564,0.99951137595496564,0,0.99951137595496564,0.99951137595496564,0,0,6.4817475433231776E-3,0.15733908429575655,2.0533615374301103E-4,5.1524125267928475E-3,0.15734171388915269,0.19450932339882396,0.37060626076024211,0.46971048460125037,0,0,0,0,0.29317105052887626,0,4,2,{"$f":"_xlfn.IFS(K26>0.005,\"High\",N26>0.005,\"Medium\",N26<=0.005,\"Low\")","v":"High"},{"$f":"_xlfn.IFS(W26>0.005,\"High\",Y26>0.005,\"Medium\", Y26<=0.005,\"Low\")","v":"High"},"High"]
["Land south of Minstrels Gallery",1.363,5.9578109394697876E-4,0,0.99940421890605302,0,0,3.8564519526297282E-2,0.99915266586545126,0,0.9994042189060528,0.9994042189060528,0,0.9994042189060528,0.9994042189060528,0,0,3.2553710907897507E-2,0.15060465025641748,0,2.0088462174472781E-2,0.15031117997028393,0.22163323257264927,0.70198977705405496,0.83511214299941305,0,0,8.3429032511479831E-2,0,0,0,4,4,{"$f":"_xlfn.IFS(K27>0.005,\"High\",N27>0.005,\"Medium\",N27<=0.005,\"Low\")","v":"High"},{"$f":"_xlfn.IFS(W27>0.005,\"High\",Y27>0.005,\"Medium\", Y27<=0.005,\"Low\")","v":"High"},"High"]
["Land to north of 123 to 207, Manor Hall Road, Southwick",1.7689999999999999,1,0,0,0,0,0,0,0,0,0,0,0,0,0,0,0,1.7989880712042002E-2,0,0,1.1463117577764387E-2,2.7051002713565971E-2,9.8990687303096098E-2,0.13317851653127699,0,0,0,0.99911260624434717,0,0,0,0,{"$f":"_xlfn.IFS(K28>0.005,\"High\",N28>0.005,\"Medium\",N28<=0.005,\"Low\")","v":"Low"},{"$f":"_xlfn.IFS(W28>0.005,\"High\",Y28>0.005,\"Medium\", Y28<=0.005,\"Low\")","v":"High"},"High"]
["Land to north of 41 to 42, The Paddocks, Lancing",0.14199999999999999,-2.6290927981058587E-3,0,1.0026290927981059,0,0,0,0.53126109692092538,0,1.0026290927981056,1.0026290927981056,0,1.0026290927981056,1.0026290927981056,0,4.9487995818068393E-4,8.2891617997173955E-2,0.28799220132507752,1.7008360085031198E-2,7.4203786009719733E-2,0.37223597919918949,0.43694507296977469,0.66439138791795638,0.94134081821426774,0,0,0,0,0,0,3,2,{"$f":"_xlfn.IFS(K29>0.005,\"High\",N29>0.005,\"Medium\",N29<=0.005,\"Low\")","v":"High"},{"$f":"_xlfn.IFS(W29>0.005,\"High\",Y29>0.005,\"Medium\", Y29<=0.005,\"Low\")","v":"High"},"High"]
["Land west of Highview, Mount Way, Lancing",0.85599999999999998,1,0,0,0,0,0,0,0,0,0,0,0,0,0,0,0,0,0,0,0,0,1.307894839234521E-2,2.1957453065242407E-2,0,0,0,0,0,0,0,0,{"$f":"_xlfn.IFS(K30>0.005,\"High\",N30>0.005,\"Medium\",N30<=0.005,\"Low\")","v":"Low"},{"$f":"_xlfn.IFS(W30>0.005,\"High\",Y30>0.005,\"Medium\", Y30<=0.005,\"Low\")","v":"Medium"},"Medium"]
["Laundry, Alma Street, Lancing BN15 8AX",0.104,1,0,0,0,0,0,0,0,0,0,0,0,0,0,0,0,0,0,0,0,0,0,0,0,0,0,0.99639644586249998,0,0,0,0,{"$f":"_xlfn.IFS(K31>0.005,\"High\",N31>0.005,\"Medium\",N31<=0.005,\"Low\")","v":"Low"},{"$f":"_xlfn.IFS(W31>0.005,\"High\",Y31>0.005,\"Medium\", Y31<=0.005,\"Low\")","v":"Low"},"Low"]
["Malthouse Industrial Estate",1.083,0.83182354654506185,0.16808149454911128,9.4958905826861498E-5,0,0,0.50959321009740255,0.87747145556871375,0,0.80810522580997968,0.91083973620498071,0,0.90077664017966586,0.92306907529767412,0,0,1.3665743305632503E-2,2.8303044071979411E-2,0,1.2557710064635273E-2,2.7933699658313667E-2,2.9411077312976642E-2,5.384253424847766E-2,0.15136660185752171,0,0,0,7.2469920175050155E-3,0,0,1,1,{"$f":"_xlfn.IFS(K32>0.005,\"High\",N32>0.005,\"Medium\",N32<=0.005,\"Low\")","v":"High"},{"$f":"_xlfn.IFS(W32>0.005,\"High\",Y32>0.005,\"Medium\", Y32<=0.005,\"Low\")","v":"High"},"High"]
["New Monks Farm (former IKEA)",7.7750000000000004,0.18087463200530174,6.7341438392624853E-2,0.75178392960207341,0,0,0.23496813930637686,0.26996930600297231,0,0.97456557719423542,0.98670384085983021,0,0.9793887283196373,0.98994666940441545,0,9.9680625272445783E-2,0.23223431967756014,0.36004459672302769,0.14629763100430737,0.22200711814830354,0.35707100841858774,0.38909251108894527,0.47791575117764629,0.49497018378006558,0,0,0.95052941108436917,0,0,0,4,4,{"$f":"_xlfn.IFS(K33>0.005,\"High\",N33>0.005,\"Medium\",N33<=0.005,\"Low\")","v":"High"},{"$f":"_xlfn.IFS(W33>0.005,\"High\",Y33>0.005,\"Medium\", Y33<=0.005,\"Low\")","v":"High"},"High"]
["New Wharf",0.35099999999999998,1,0,0,0,0,0.99929476014111396,0.99929567213666093,0,0.99967711721681196,0.99967711721681196,0,0.99967711721681196,0.99967711721681196,0,0,0,3.3622246980361259E-2,0,0,3.3622246980361252E-2,4.1599454957569233E-2,0.16537380032488008,0.17950042425443447,0,0,0,0,0,0,2,1,{"$f":"_xlfn.IFS(K34>0.005,\"High\",N34>0.005,\"Medium\",N34<=0.005,\"Low\")","v":"High"},{"$f":"_xlfn.IFS(W34>0.005,\"High\",Y34>0.005,\"Medium\", Y34<=0.005,\"Low\")","v":"High"},"High"]
["Police Station, 107 - 111 North Road, Lancing BN15 9BB",0.11600000000000001,1,0,0,0,0,0,0,0,0,0,0,0,0,0,0,0,0,0,0,0,0,0,0,0,0,0.45629630603733445,0.54995192689070516,0,0,0,0,{"$f":"_xlfn.IFS(K35>0.005,\"High\",N35>0.005,\"Medium\",N35<=0.005,\"Low\")","v":"Low"},{"$f":"_xlfn.IFS(W35>0.005,\"High\",Y35>0.005,\"Medium\", Y35<=0.005,\"Low\")","v":"Low"},"Low"]
["Rectory Farm Industrial Estate, Rectory Farm Road, Sompting",0.99199999999999999,1,0,0,0,0,0,0,0,0,0,0,0,0,0,0,1.2500000000000001E-2,0.19692888877333972,0,0,0.20619629032293951,0.25283786885814213,0.3219339941649304,0.33696202700534278,0,0,0,0,0,0,0,0,{"$f":"_xlfn.IFS(K36>0.005,\"High\",N36>0.005,\"Medium\",N36<=0.005,\"Low\")","v":"Low"},{"$f":"_xlfn.IFS(W36>0.005,\"High\",Y36>0.005,\"Medium\", Y36<=0.005,\"Low\")","v":"High"},"High"]
["Shoreham Airport",93.022000000000006,2.1083924908873078E-2,3.8638372121783157E-2,0.91967466059224734,2.0603042377096387E-2,0,0.64526214419367667,0.83233368821416109,0,0.99955635373488838,0.99955635373488838,0,0.99955635373488838,0.99955635373488838,0,0,2.5952503998247834E-3,5.322971301240921E-2,5.1600696609404228E-4,1.9868817887110685E-3,6.4579296565977717E-2,0.12883357874076992,0.29118144600814749,0.33971958751378167,0,0,9.8816214014914002E-4,2.648102344628948E-3,3.2268133721094903E-2,2,4,4,{"$f":"_xlfn.IFS(K37>0.005,\"High\",N37>0.005,\"Medium\",N37<=0.005,\"Low\")","v":"High"},{"$f":"_xlfn.IFS(W37>0.005,\"High\",Y37>0.005,\"Medium\", Y37<=0.005,\"Low\")","v":"High"},"High"]
["Shoreham Gateway",2.4809999999999999,-4.0732490350858797E-5,0,1.0000407324903509,0,0,1.0000407324903506,1.0000407324903506,0,1.0000407324903506,1.0000407324903506,0,1.0000407324903506,1.0000407324903506,0,7.1813718314795244E-2,0.17413484145494079,0.43806541458091497,0.11615929320637043,0.16636005444749458,0.42984292364983878,0.50061518135016525,0.70262974151422009,0.76666494731158008,0,0,0,0,0,0,4,2,{"$f":"_xlfn.IFS(K38>0.005,\"High\",N38>0.005,\"Medium\",N38<=0.005,\"Low\")","v":"High"},{"$f":"_xlfn.IFS(W38>0.005,\"High\",Y38>0.005,\"Medium\", Y38<=0.005,\"Low\")","v":"High"},"High"]
["Shoreham Police Station, Ham Road, Shoreham-by-Sea",0.29599999999999999,1,0,0,0,0,0,0,0,8.4459459459459464E-3,1.0272200710253481E-2,0,8.4459459459459464E-3,6.1124326941046289E-2,0,0,0,1.55954191525749E-3,0,0,9.4156494874278387E-4,3.834676026896554E-3,4.4799175072621621E-2,9.6315903581616888E-2,0,0,0,0,0,0,0,0,{"$f":"_xlfn.IFS(K39>0.005,\"High\",N39>0.005,\"Medium\",N39<=0.005,\"Low\")","v":"High"},{"$f":"_xlfn.IFS(W39>0.005,\"High\",Y39>0.005,\"Medium\", Y39<=0.005,\"Low\")","v":"Medium"},"High"]
["Southwick Estates",3.1890000000000001,1,0,0,0,0,0,1.1721009566330886E-3,0,7.9497098268015371E-4,1.1491809406734024E-2,0,4.7876999527071496E-3,6.9843968307653811E-2,0,0,4.575144015771841E-3,3.6661922542846344E-2,0,4.6312689390284418E-3,3.5073910626869549E-2,4.8413467328480092E-2,0.15755204335467918,0.20999393075629191,0,0,0,3.5887125197337728E-2,0,0,0,0,{"$f":"_xlfn.IFS(K40>0.005,\"High\",N40>0.005,\"Medium\",N40<=0.005,\"Low\")","v":"Low"},{"$f":"_xlfn.IFS(W40>0.005,\"High\",Y40>0.005,\"Medium\", Y40<=0.005,\"Low\")","v":"High"},"High"]
["Technology House",7.8E-2,1,0,0,0,0,0,0,0,0,0,0,0,0,0,0,0,0,0,0,0,0,0,0,0,0,0,1.0022286145229051,0,0,0,0,{"$f":"_xlfn.IFS(K41>0.005,\"High\",N41>0.005,\"Medium\",N41<=0.005,\"Low\")","v":"Low"},{"$f":"_xlfn.IFS(W41>0.005,\"High\",Y41>0.005,\"Medium\", Y41<=0.005,\"Low\")","v":"Low"},"Low"]

{"sheet":"Sheet1","index":2,"n_rows":0,"n_cols":0,"rows_kept":0,"cut":false,"hidden":false,"merged":[]}

{"sheet":"Raw Areas","index":3,"n_rows":41,"n_cols":37,"rows_kept":41,"cut":false,"hidden":false,"merged":[[1,31,1,32],[1,33,1,34],[1,35,1,36],[0,0,1,0],[0,1,1,1],[0,2,1,2],[0,3,0,36],[1,3,1,5],[1,6,1,9],[1,20,1,22],[1,29,1,30],[1,10,1,19],[1,23,1,28]]}
["SHLAA cat","Site Name","Area (ha)","Proportion of site shown to be at risk (%)"]
[null,null,null,"Flood Map for Planning Flood Zones",null,null,"SFRA Flood Zones",null,null,null,"Fluvial and Tidal Flood Risk plus climate change",null,null,null,null,null,null,null,null,null,"EA Risk of Flooding from Surface Water",null,null,"EA Risk of Flooding from Surface Water plus CC",null,null,null,null,null,"EA Reservoir Flood Extent",null,"JBA Groundwater Flood Risk Dataset",null,"Historic Flooding",null,"Tidally influenced"]
[null,null,null,"FZ1","FZ2","FZ3","FZ1","FZ2","FZ3a","FZ3b","3.3%AEP plus Central","3.3%AEP and 0.5% plus Higher Central","3.3%AEP and 0.5% plus Upper End","1%AEP plus Central","1%AEP and 0.5% plus Higher Central","1%AEP and 0.5% plus Upper End","0.1%AEP plus Central","0.1%AEP and 0.5% plus Higher Central","0.1%AEP and 0.5% plus Upper End","Flood Zone 2 as proxy where no detailed model available","30 year","100 year","1000 year ","3.3%AEP+20%","3.3%AEP +40%","1%AEP+25%","1%AEP +45%","0.1%AEP+25%","0.1%AEP +45%","Dry Day","Wet day","0- 0.025m\n(grid code 4)","0.025- 0.05m\n(grid code 3)","EA Historic Flood Map","West Sussex ","Tidally influenced Drainage Risk Zone (maximum risk)\n","Tidally influenced Groundwater Risk Zone (maximum risk)"]
[null,"Temp site 1",0.747,null,0.74624127349748703,0.73990594422575295,null,0.74624127349748703,0.69390318998599498,{"$f":"I4*0.0001","v":6.9390318998599506E-5},0,0,0,0,0.74624127349748703,0.74624127349748703,0,0.74624127349748703,0.74624127349748703,0,0,0,3.1506761466914099E-2,0,0,2.6864889236877899E-2,8.4217023245093406E-2,0.444442512885449,0.46326066687001399,0,0,6.0481414065250111E-5,2.8844546519394302E-3,0,0,3,4]
[null,"Temp site 2",1.571,null,1.33320895437951,1.1160934341903199,null,1.2817252548336902,0.89253856817081401,{"$f":"I5*0.0001","v":8.9253856817081404E-5},0,0,0,0,1.3940215476772899,1.39902154767729,0,1.3965215476772901,1.4065215476772901,0,0,1.84E-2,4.1607100313998807E-2,1.4E-2,1.7600000000000001E-2,6.0340860781401197E-2,0.109352565045206,0.235699844790763,0.40066459285803402,0,0,0,0,0,0,3,2]
[null,"Temp site 3",2.6150000000000002,null,1.7354204320845701,1.4366449098868199,null,1.6459937855435403,1.19772317863476,1.19772317863476E-4,0,0,0,0,2.4770338556154901,2.4945338556154999,0,2.4845338556155001,2.5014088556154999,0,2.2000000000000002E-2,8.4400000000000003E-2,0.22630615229940002,4.5199999999999997E-2,7.6399999999999996E-2,0.22070615229939999,0.49836215796546302,0.93861117617512402,1.0876032957725099,0,0,2.0561175489499501E-2,2.6938999999314501E-2,0,0,4,4]
[null,"Land north west of West Avenue",7.27,null,7.2664477031926005,7.2664477031926005,null,7.2664477031926005,7.2664477031926005,7.2664477031926013E-4,0,0.96841365789556,6.7334590902806299,0,7.2664477031925996,7.2664477031925996,0,7.2664477031925996,7.2664477031925996,0,0,4.7122304639959499E-2,1.14385514283015,1.49279383771169E-3,3.7458039069783997E-2,1.1438742599741401,1.4140827811094501,2.69430751572696,3.4147952230510898,0,0,0,0,2.1313535373449302,0,4,2]
[null,"Land north of Willowbrook Park",0.94799999999999995,null,0.947205541083043,0.947205541083043,null,0.947205541083043,0.947205541083043,9.4720554108304299E-5,0,0.171021885568792,0.947205541083043,0,0.947205541083043,0.947205541083043,0,0.947205541083043,0.947205541083043,0,8.9764100268564205E-3,0.13003056424881401,0.46234625020932901,4.5583801873481697E-2,0.108112316432598,0.46773411450415098,0.50741356548226701,0.72055044318507799,0.77973027433893205,0,0,0,0,0,0,4,2]
[null,"Land south of Minstrels Gallery",1.363,null,1.3621879503689502,1.3621879503689502,null,1.3621879503689502,1.3621879503689502,1.3621879503689503E-4,0,5.2563440114343198E-2,1.3618450835746101,0,1.36218795036895,1.36218795036895,0,1.36218795036895,1.36218795036895,0,0,4.4370707967464305E-2,0.20527413829949701,0,2.7380573943806399E-2,0.20487413829949699,0.30208609599652098,0.95681206612467695,1.1382578509082,0,0,0.11371377131314701,0,0,0,4,4]
[null,"Land east of Minstrels Gallery",3.1059999999999999,null,3.1045918141160298,3.1045918141160298,null,3.1045918141160298,3.1045918141160298,3.1045918141160299E-4,0,3.0111980802168301E-2,2.7659769433668999,0,3.10459181411602,3.10459181411602,0,3.10459181411602,3.10459181411602,0,0,1.3111273778735302E-2,0.145650359399525,0.01,1.29083531693765E-2,8.7472972621143105E-2,0.154726107016459,0.47762563799634999,0.66191423963904095,0,0,0.40790529636775102,2.6644088085667501E-3,3.7426427199552102E-2,0,3,4]
[null,"Land north of Minstrels Gallery",1.016,null,1.01109847262922,0.93134839709125217,null,1.0102883599856001,0.880306893271393,8.803068932713931E-5,0,0,0,0,1.01518346808836,1.01518346808836,0,1.01518346808836,1.01518346808836,0,0,0,1.8800000000000001E-2,0,0,0,1.04E-2,3.0800000000000001E-2,3.7151769637967402E-2,0,0,0.13302050553299802,0.84385828712018507,0,0,2,4]
[null,"Police Station, 107 - 111 North Road, Lancing BN15 9BB",0.11600000000000001,null,0,0,null,0,0,0,0,0,0,0,0,0,0,0,0,0,0,0,0,0,0,0,0,0,0,0,0,5.2930371500330801E-2,6.3794423519321797E-2,0,0,0,0]
[null,"Laundry, Alma Street, Lancing BN15 8AX",0.104,null,0,0,null,0,0,0,0,0,0,0,0,0,0,0,0,0,0,0,0,0,0,0,0,0,0,0,0,0,0.10362523036969999,0,0,0,0]
[null,"Rectory Farm Industrial Estate, Rectory Farm Road, Sompting",0.99199999999999999,null,0,0,null,0,0,0,0,0,0,0,0,0,0,0,0,0,0,1.2400000000000001E-2,0.19535345766315301,0,0,0.20454672000035601,0.25081516590727698,0.31935852221161098,0.33426633078930001,0,0,0,0,0,0,0,0]
[null,"Community Buildings, Pond Road, Shoreham-by-Sea",0.59,null,0,0,null,0,0,0,0,0,0,0,0,0.23338609017997899,0,8.2077117114853499E-4,0.44676208194627498,0,0,0,8.8290145905196099E-2,0,0,8.7890145905196101E-2,9.7445647583157699E-2,0.17111500418581799,0.190180041785973,0,0,0,0,0,0,0,0]
[null,"Land east of, Adur Close, Lancing",0.189,null,0.18858095722400703,0.18858095722400703,null,0.18858095722400703,0.18858095722400703,1.8858095722400704E-5,0,0,0.188580957224007,0,0.188580957224007,0.188580957224007,0,0.188580957224007,0.188580957224007,0,0,0,0,0,0,0,0,6.7916047216363604E-4,7.1806901563586305E-4,0,0,0,0,0,0,2,2]
[null,"Land at junction of Saltings Roundabout, New Salts Farm, New Salts Farm Road, Lancing",0.90700000000000003,null,0.90642954238913209,0.90642954238913209,null,0.90642954238913209,0.90642954238913209,9.0642954238913219E-5,0,0,0.500490404530476,0,0.90642954238913198,0.90642954238913198,0,0.90642954238913198,0.90642954238913198,0,0,1.3361189999990201E-2,4.1732221893524005E-2,8.6798839999848096E-3,1.3087829999998199E-2,2.1749190423665202E-2,3.2129255843220898E-2,7.5330614024904097E-2,8.7836873664939003E-2,0,0,0,0,0,0,3,2]
[null,"Land at Mill Hill, Shoreham-by-Sea",5.9160000000000004,null,0,0,null,0,0,0,0,0,0,0,0,0,0,0,0,0,0,0,0,0,0,0,5.1520968681074098E-3,1.01908700002357E-2,4.0125357262301799E-2,0,0,0,0,0,0,0,0]
[null,"Shoreham Police Station, Ham Road, Shoreham-by-Sea",0.29599999999999999,null,0,0,null,2.5000000000000001E-3,2.5000000000000001E-3,2.5000000000000004E-7,0,0,0,0,2.5000000000000001E-3,3.0405714102350301E-3,0,2.5000000000000001E-3,1.8092800774549701E-2,0,0,0,4.6162440691621703E-4,0,0,2.78703224827864E-4,1.13506410396138E-3,1.3260555821496E-2,2.8509507460158599E-2,0,0,0,0,0,0,0,0]
[null,"Land at Eastbrook Primary School, Manor Hall Road, Southwick",0.70499999999999996,null,0,0,null,0,0,0,0,0,0,0,0,0,0,0,0,0,0,2.2000000000000002E-2,0.11365543320733,1.7600000000000001E-2,2.12E-2,0.106327233207457,0.151496348023415,0.268688164334066,0.29151041433501301,0,0,0,0.704399971005223,0,0,0,0]
[null,"Land west of Highview, Mount Way, Lancing",0.85599999999999998,null,0,0,null,0,0,0,0,0,0,0,0,0,0,0,0,0,0,0,0,0,0,0,0,1.11955798238475E-2,1.87955798238475E-2,0,0,0,0,0,0,0,0]
[null,"Land east of Manor Close",2.8319999999999999,null,2.8310492950428903,2.8310492950428903,null,2.8310492950428903,2.8310492950428903,2.8310492950428903E-4,0,0,0.239816447386799,0,2.8310492950428898,2.8310492950428898,0,2.8310492950428898,2.8310492950428898,0,0.28805018712369002,1.05486121101355,2.1933056562280702,0.52391330035334904,0.93891021607006897,2.1929056562280702,2.2339880964405001,2.4019365799594699,2.4786841340506198,0,0,2.8310492950428903,0,0.46822735929554804,0,4,4]
[null,"Co-op Ham Road",0.57699999999999996,null,0,0,null,0,0,0,0,0,4.2505916840829402E-3,0,8.7546645717997799E-3,7.9224376095372695E-2,0,4.6138404613424097E-2,0.18910175580697,0,0,0,1.4763311097484601E-2,0,0,1.38711922217161E-2,1.9323987295291899E-2,4.0903807380573101E-2,4.8136459634163901E-2,0,0,0,0,0,0,2,1]
[null,"Land north of Hill Farm Way",0.24299999999999999,null,0,0,null,0,0,0,0,0,0,0,0,0,0,0,0,0,0,0,0,0,0,0,0,1.09106603662024E-3,2.0821116036144099E-2,0,0,0,0,0,0,0,0]
[null,"Technology House",7.8E-2,null,0,0,null,0,0,0,0,0,0,0,0,0,0,0,0,0,0,0,0,0,0,0,0,0,0,0,0,0,7.8173831932786597E-2,0,0,0,0]
[null,"B&Q and Halfords",1.2989999999999999,null,0,0,null,8.0837732042862206E-3,0,0,0,0.32765551574358898,0.68250277226288703,0,0.74259273477196996,1.11470701827729,0,1.0255127609341299,1.2504707686438099,0,4.3617380916504802E-3,6.6448132413298097E-3,4.3246397957088102E-2,3.0553462113096499E-3,3.0553462113096499E-3,4.2846397957088098E-2,5.0129702107649901E-2,0.13149944954981399,0.15734188046949801,0,0,0,0.9212686205383811,0,0,3,2]
[null,"Southwick Estates",3.1890000000000001,null,0,0,null,0,0,0,0,0,3.7378299507029198E-3,0,2.5351624637670101E-3,3.66473801980748E-2,0,1.52679751491831E-2,0.222732414933108,0,0,1.4590134266296401E-2,0.116914870989137,0,1.4769116646561701E-2,0.111850700989087,0.15439054731052301,0.50243346625807195,0.66967064518181496,0,0,0,0.11444404225431001,0,0,0,0]
[null,"Shoreham Gateway",2.4809999999999999,null,2.4811010573085603,2.4811010573085603,null,2.4811010573085603,2.4811010573085603,2.4811010573085604E-4,0,2.4811010573085599,2.4811010573085599,0,2.4811010573085599,2.4811010573085599,0,2.4811010573085599,2.4811010573085599,0,0.178169835139007,0.43202854164970805,1.0868402935752499,0.28819120644500501,0.41273929508423401,1.0664402935752499,1.24202626492976,1.74322438869678,1.90209573428003,0,0,0,0,0,0,4,2]
[null,"Land to north of 123 to 207, Manor Hall Road, Southwick",1.7689999999999999,null,0,0,null,0,0,0,0,0,0,0,0,0,0,0,0,0,0,0,3.1824098979602297E-2,0,0,2.0278254995065199E-2,4.7853223800298203E-2,0.175114525839177,0.23559279574382899,0,0,0,1.7674302004462501,0,0,0,0]
[null,"Eastbrook Allotments, Old Shoreham Road, Southwick",4.18,null,0,0,null,0,0,0,0,0,0,0,0,0,0,0,0,0,0,0,6.3513998311589104E-2,0,0,5.91139983115892E-2,0.13770675831159501,0.39973591309694001,0.52727018564129902,0,0,0,1.37364488427914,0,0,0,0]
[null,"Car Park, Beach Green, Shoreham-by-Sea",0.95599999999999996,null,0.95561470259591808,0.95561470259591808,null,0.95561470259591808,0.95561470259591808,9.5561470259591808E-5,0,5.9298577491682599E-4,0.95561470259591796,0,0.95561470259591796,0.95561470259591796,0,0.95561470259591796,0.95561470259591796,0,0,5.0544879918488598E-6,0.10969376127415802,0,0,0.113316161445623,0.184799046332706,0.60362003195122205,0.70846078364575304,0,0,0,0,0,0,3,2]
[null,"Car Park, Tarmount Lane, Shoreham-by-Sea",0.16500000000000001,null,0,0,null,0,0,0,0,0,0,0,0,0,0,0,0,0,0,0,2.9869101056367902E-5,0,0,2.9869101056367899E-5,2.9869101056367899E-5,1.30708685339059E-2,1.67813817474976E-2,0,0,0,0,0,0,0,0]
[null,"Land to north of 41 to 42, The Paddocks, Lancing",0.14199999999999999,null,0.14237333117733103,0.14237333117733103,null,0.14237333117733103,0.14237333117733103,1.4237333117733104E-5,0,0,7.5439075762771396E-2,0,0.142373331177331,0.142373331177331,0,0.142373331177331,0.142373331177331,0,7.0272954061657104E-5,1.1770609755598701E-2,4.0894892588161001E-2,2.41518713207443E-3,1.05369376133802E-2,5.2857509046284903E-2,6.2046200361708E-2,9.4343577084349803E-2,0.13367039618642601,0,0,0,0,0,0,3,2]
[null,"Egypt Wharf / Lennards Wharf",2.6230000000000002,null,1.7843076147331203,1.3942344591875702,null,1.61777136152613,0.97970996210458716,9.7970996210458716E-5,0,2.3413237943160299,2.4785878110877002,0,2.4347607328807999,2.5141293729112801,0,2.4907799265749002,2.5407129831321802,0,0,0.12683224248752101,0.324744850923808,1.01570197515615E-2,0.11135701975156199,0.32194485092380798,0.35652237085401201,0.53201834218917998,0.71671050297814198,0,0,0,0,0,0,4,2]
[null,"Fishermans Wharf",0.995,null,0.42789596073661595,0.35511465417486604,null,0.40177598580444601,0.25202237395985799,2.5202237395985801E-5,0,0.94792284922653902,0.961995003129969,0,0.99454924908295095,0.99454924908295095,0,0.99454924908295095,0.99454924908295095,0,0,0,2.5534011309887503E-2,0,0,2.55340113098875E-2,3.64087513097704E-2,0.11472104056532,0.15279099853394701,0,0,0,0,0,0,2,1]
[null,"77A Brighton Road",5.3999999999999999E-2,null,5.4182852309181705E-2,5.1028354518361303E-2,null,5.4182852309181705E-2,4.7229939223072503E-2,4.7229939223072503E-6,0,5.4182852309181698E-2,5.4182852309181698E-2,0,5.4182852309181698E-2,5.4182852309181698E-2,0,5.4182852309181698E-2,5.4182852309181698E-2,0,0,0,0,0,0,0,0,8.2922932173645093E-3,8.8966026750614997E-3,0,0,0,0,0,0,2,2]
[null,"New Wharf",0.35099999999999998,null,0,0,null,0,0,0,0,0.35075246080953099,0.35075278091996798,0,0.35088666814310099,0.35088666814310099,0,0.35088666814310099,0.35088666814310099,0,0,0,1.1801408690106801E-2,0,0,1.1801408690106799E-2,1.46014086901068E-2,5.8046203914032903E-2,6.3004648913306496E-2,0,0,0,0,0,0,2,1]
[null,"5 Brighton Road",0.503,null,0.49943566647295407,0.48369996425366002,null,0.49568089756127703,0.45601722489815605,4.5601722489815607E-5,0,0.50325176468365396,0.50325176468365396,0,0.50325176468365396,0.50325176468365396,0,0.50325176468365396,0.50325176468365396,0,0,0,0,0,0,1.38104999996722E-3,1.38104999996722E-3,1.01854236054932E-2,4.1743495621588703E-2,0,0,3.8874749997630702E-3,0,0,0,3,2]
[null,"Malthouse Industrial Estate",1.083,null,0.18213509909169801,1.02840495010491E-4,null,0.155020262195011,0,0,0,0.55188944653548699,0.950301586380917,0,0.87517795955220801,0.98643943430999403,0,0.97554110131457805,0.99968380854738104,0,0,1.4800000000000001E-2,3.0652196729953701E-2,0,1.3599999999999999E-2,3.02521967299537E-2,3.1852196729953701E-2,5.83114645911013E-2,0.16393002981169599,0,0,0,7.8484923549579314E-3,0,0,1,1]
[null,"Shoreham Airport",93.022000000000006,null,91.060731137126808,87.466512485614302,null,90.954960007872501,87.204447914584009,8.7204447914584014E-3,0,60.023575177184199,77.425344345057695,0,92.980731137126796,92.980731137126796,0,92.980731137126796,92.980731137126796,0,0,0.24141538269250101,4.95153436384033,4.8000000000000001E-2,0.184823717749481,6.0072953251603796,11.984357161623899,27.0862804705699,31.601395469707001,0,0,9.1920818600953316E-2,0.24633177630207403,3.0016463350036902,2,4,4]
[null,"New Monks Farm (former IKEA)",7.7750000000000004,null,6.3686997361587796,5.8451200526561209,null,6.2384973626851803,5.8236681483586006,5.823668148358601E-4,0,1.8268772831070801,2.0990113541731099,0,7.5772473626851804,7.6716223626851798,0,7.61474736268518,7.6968353546193304,0,0.77501686149326598,1.8056218354930302,2.7993467395215403,1.13746408105849,1.72610534360306,2.7762270904545199,3.0251942737165498,3.7157949654062001,3.8483931788900101,0,0,7.3903661711809709,0,0,0,4,4]

{"sheet":"Calculations","index":4,"n_rows":75,"n_cols":44,"rows_kept":75,"cut":false,"hidden":true,"merged":[[0,30,0,31],[0,32,0,33]]}
["Name","SHLAA REF","HELAA ref","Achieveable ","Site (ha)",null,"FZ3b (ha)",null,"FZ3b (%)","FZ3a (ha)",null,null,"FZ3a (%)","FZ2 (ha)",null,null,"FZ2 (%)","FZ1 (%)","FZ2(proxy)","HFM","HFM","HF Instances (within 50m)","SW30",null,"SW100",null,null,"SW1000",null,null,"GW High Risk",null,"GW Moderate Risk",null,"Fluvial CC 25%",null,"Fluvial CC 35%",null,"Fluvial CC 70%",null,"Surface Water +20%",null,"Surface Water +40%"]
[" Gatwick Airport","N/A",null,null,693.76347093100003,{"$f":"ROUND(E2,2)","v":693.76},40.286493974782701,{"$f":"ROUND(G2,2)","v":40.29},{"$f":"H2/F2","v":5.8074838560885605E-2},195.44081511168699,{"$f":"ROUND(J2,2)","v":195.44},{"$f":"K2/F2","v":0.28171125461254615},{"$f":"L2-I2","v":0.22363641605166054},351.43053553878002,{"$f":"ROUND(N2,2)","v":351.43},{"$f":"O2/F2","v":0.50655846402214022},{"$f":"P2-L2","v":0.22484720940959407},{"$f":"1-P2","v":0.49344153597785978},0,22.962637054615101,{"$f":"T2/E2","v":3.3098653960261487E-2},0,25.642205365977301,{"$f":"W2/E2","v":3.6961019771719304E-2},60.7567238769387,{"$f":"Y2/E2","v":8.7575559138917833E-2},{"$f":"Y2/E2","v":8.7575559138917833E-2},202.16259748975,{"$f":"AB2/E2","v":0.29139988765689362},{"$f":"AB2/E2","v":0.29139988765689362},0,{"$f":"AE2/E2","v":0},242.186768905875,{"$f":"AG2/E2","v":0.34909126676974073},256.258545868201,{"$f":"AI2/E2","v":0.36937451538679789},276.01701542919,{"$f":"AK2/E2","v":0.39785463921700476},326.54034680169002,{"$f":"AM2/E2","v":0.47067964873314422},90.680277632724795,{"$f":"AO2/E2","v":0.1307077720754537},121.30526037937901,{"$f":"AQ2/E2","v":0.17485103419554893}]
[" Town Centre","N/A",null,null,63.732532557500001,63.73,0,0,0,0,0,0,0,0,0,0,0,1,0,0,0,0,2.5217730616761602,3.9568066111306595E-2,6.86444892854652,0.10770714191144623,0.10770714191144623,16.910272894138,0.26533188334986402,0.26533188334986402,0,0,0,0,0,0,0,0,0,0,9.2494554454024893,0.14512926246979996,11.249052884863399,0.1765040934896854]
[" Area Action Plan","N/A",null,null,603.68752746400003,603.69000000000005,29.897403423564999,29.9,4.9528731633785544E-2,47.664350872844601,47.66,7.8947804336662847E-2,2.9419072702877302E-2,83.050544294767505,83.05,0.13757060743096622,5.8622803094303372E-2,0.86242939256903384,0,32.576071807591902,5.3961810250476853E-2,0,23.7827707392889,3.9395829228403512E-2,44.111309117061801,7.3069770552270208E-2,7.3069770552270208E-2,137.61410956268099,0.22795586011322289,0.22795586011322289,0,0,120.597214019292,0.19976760912371777,58.275790947143498,9.6533037864723295E-2,61.394355937484299,0.10169889743356583,71.358163015300093,0.11820380539426571,62.606901145616597,0.10370746172050087,82.265161405424294,0.13627109665658954]
[" Area Action Plan","N/A",null,null,6.0845750302499999,6.08,0.72893366189733599,0.73,0.12006578947368421,0.95118383138853901,0.95,0.15625,3.6184210526315791E-2,1.44214209558912,1.44,0.23684210526315788,8.0592105263157882E-2,0.76315789473684215,0,0,0,0,0.13813232188531599,2.2702049230813821E-2,0.196365741513294,3.2272712644193631E-2,3.2272712644193631E-2,1.2041329649954899,0.19789927135568827,0.19789927135568827,0,0,0.19985764609418499,3.2846607215881986E-2,1.13033871321553,0.18577118493829917,1.1894051525231999,0.19547875514887525,1.41603902064579,0.23272603486781368,0.32274500842183501,5.3043147108430715E-2,0.49583574030591199,8.1490611561336829E-2]
[" Land at Jersey Farm (Site A)","N/A",null,null,0.66438541001999996,0.66,0,0,0,0,0,0,0,0,0,0,0,1,0,0,0,0,0,0,0,0,0,0.217153033784273,0.32684798689022393,0.32684798689022393,0,0,0,0,0,0,0,0,0,0,0,0,0,0]
[" Space Gatwick, Faraday Road","N/A",null,null,1.55550452886,1.56,0,0,0,0,0,0,0,0,0,0,0,1,0,0,0,0,0,0,0,0,0,3.7839602115102202E-3,2.4326256473733402E-3,2.4326256473733402E-3,0,0,0,0,0,0,0,0,0,0,6.6941348370143803E-7,4.303513562844067E-7,3.6552880101322099E-6,2.3499050901581764E-6]
[" Southways, London Road","N/A",null,null,2.87416329701,2.87,0,0,0,0,0,0,0,0,0,0,0,1,0,0,0,0,2.8460236550829701E-3,9.902094491442766E-4,2.98301392759821E-2,1.0378721107118192E-2,1.0378721107118192E-2,0.35794339514092399,0.12453829450584575,0.12453829450584575,0,0,4.2212904440118203E-3,1.4687023692784751E-3,0,0,0,0,0,0,8.3328711349656803E-2,2.899233715646703E-2,0.170765889854957,5.9414122375233594E-2]
[" Gatwick Park (Site G1), Gatwick Road","N/A",null,null,0.79687919737400004,0.8,0,0,0,0,0,0,0,0,0,0,0,1,0,0,0,0,0,0,1.12E-2,1.405482792988947E-2,1.405482792988947E-2,9.1313528822081394E-2,0.11458892279154971,0.11458892279154971,0,0,0,0,0,0,0,0,0,0,3.9600000000000003E-2,4.9693855894966346E-2,5.6139872935987503E-2,7.0449665546532425E-2]
[" Gatwick Park (Site G2), BCL House, Gatwick Road\r\n","N/A",null,null,0.44394294431300002,0.44,0,0,0,0,0,0,0,0,0,0,0,1,0,0,0,0,0,0,0,0,0,2.7500204595661201E-2,6.1945357951836942E-2,6.1945357951836942E-2,0,0,0,0,0,0,0,0,0,0,0,0,3.0559718985168802E-5,6.8837041733954907E-5]
[" Manor Royal","N/A",null,null,241.42064488899999,241.42,5.1180497180121698,5.12,2.1207853533261538E-2,14.1497161186394,14.15,5.861154833899429E-2,3.7403694805732753E-2,29.123478437715701,29.12,0.12061966697042499,6.20081186314307E-2,0.87938033302957497,0,2.4492526799993102,1.0145166670089146E-2,0,6.1120258777289003,2.531691471762524E-2,16.9777079972562,7.0324176315004816E-2,7.0324176315004816E-2,50.447918064777603,0.20896273426811726,0.20896273426811726,0,0,1.27023726375602,5.2615105238412721E-3,19.023323882373301,7.8797419711639893E-2,20.2456761578654,8.3860583535322455E-2,23.8982766352505,9.8990194671372919E-2,23.4239255005409,9.7025362148753749E-2,30.3037517390377,0.12552261946351237]
[" Land West of Bewbush","SA289",null,null,134.34006202,{"$f":"ROUND(E12,2)","v":134.34},0,{"$f":"ROUND(G12,2)","v":0},0,2.19559822349995,{"$f":"ROUND(J12,2)","v":2.2000000000000002},{"$f":"K12/F12","v":1.6376358493375019E-2},1.6376358493375019E-2,3.4072231017274102,{"$f":"ROUND(N12,2)","v":3.41},{"$f":"O12/F12","v":2.538335566473128E-2},9.0069971713562617E-3,0.97461664433526873,{"$f":"Q12+M12","v":2.538335566473128E-2},0,{"$f":"T12/E12","v":0},0,6.9608823616522804,{"$f":"W12/E12","v":5.181538743532791E-2},10.5231240023077,{"$f":"Y12/E12","v":7.8331987078739479E-2},{"$f":"Y12/E12","v":7.8331987078739479E-2},22.6029621030271,{"$f":"AB12/E12","v":0.16825183614744843},{"$f":"AB12/E12","v":0.16825183614744843},0,{"$f":"AE12/E12","v":0},0,{"$f":"AG12/E12","v":0},0,{"$f":"AI12/E12","v":0},0,{"$f":"AK12/E12","v":0},0,{"$f":"AM12/E12","v":0},13.553014881629201,{"$f":"AO12/E12","v":0.10088587631894559},16.2736119205127,{"$f":"AQ12/E12","v":0.12113744534441223}]
["Land West of Kilnwood Vale","SA291",null,null,35.135471601699997,{"$f":"ROUND(E13,2)","v":35.14},0,{"$f":"ROUND(G13,2)","v":0},0,0,{"$f":"ROUND(J13,2)","v":0},{"$f":"K13/F13","v":0},0,0,{"$f":"ROUND(N13,2)","v":0},{"$f":"O13/F13","v":0},0,1,0,0,{"$f":"T13/E13","v":0},0,1.93627379092041,{"$f":"W13/E13","v":5.5108803230827424E-2},2.9783313249905001,{"$f":"Y13/E13","v":8.4767079797682193E-2},{"$f":"Y13/E13","v":8.4767079797682193E-2},9.8663492939756203,{"$f":"AB13/E13","v":0.28080879078048993},{"$f":"AB13/E13","v":0.28080879078048993},0,{"$f":"AE13/E13","v":0},0,{"$f":"AG13/E13","v":0},0,{"$f":"AI13/E13","v":0},0,{"$f":"AK13/E13","v":0},0,{"$f":"AM13/E13","v":0},3.7781525268874199,{"$f":"AO13/E13","v":0.10753100370238428},4.7577267991763401,{"$f":"AQ13/E13","v":0.13541092754099085}]
["Land off Rusper Road, Ifield","SA468",null,null,4.5456317408800002,{"$f":"ROUND(E14,2)","v":4.55},5.3826782455341698E-2,{"$f":"ROUND(G14,2)","v":0.05},1.098901098901099E-2,5.3826782455341698E-2,{"$f":"ROUND(J14,2)","v":0.05},{"$f":"K14/F14","v":1.098901098901099E-2},0,5.9836017036746E-2,{"$f":"ROUND(N14,2)","v":0.06},{"$f":"O14/F14","v":1.3186813186813187E-2},2.1978021978021969E-3,0.98681318681318686,0,0,{"$f":"T14/E14","v":0},0,7.0704240250198405E-2,{"$f":"W14/E14","v":1.5554326500833214E-2},0.16664623099933701,{"$f":"Y14/E14","v":3.6660741674396077E-2},{"$f":"Y14/E14","v":3.6660741674396077E-2},0.58725963923957003,{"$f":"AB14/E14","v":0.12919208433850846},{"$f":"AB14/E14","v":0.12919208433850846},0,{"$f":"AE14/E14","v":0},0,{"$f":"AG14/E14","v":0},5.4046942404054901E-2,{"$f":"AI14/E14","v":1.1889863826406628E-2},5.5703891434387698E-2,{"$f":"AK14/E14","v":1.2254378403210428E-2},5.79488288502302E-2,{"$f":"AM14/E14","v":1.2748245382282494E-2},0.22016532099969099,{"$f":"AO14/E14","v":4.8434482498810744E-2},0.32850573099959102,{"$f":"AQ14/E14","v":7.2268443579636479E-2}]
["2 - 12 Friston Walk","N/A",null,null,0.53271091729599995,0.53,0,0,0,0,0,0,0,0,0,0,0,1,0,0,0,0,0,0,3.9212632487519203E-2,7.3609590519675361E-2,7.3609590519675361E-2,0.294671617104174,0.55315483039075808,0.55315483039075808,0,0,0,0,0,0,0,0,0,0,0.101351828666955,0.1902567140568644,0.164613201115027,0.30901037649198382]
["Parkside Car Park","N/A",null,null,0.24278223874099999,0.24,0,0,0,0,0,0,0,0,0,0,0,1,0,0,0,0,1.2316259999200699E-2,5.0729658244644829E-2,2.7229869999922801E-2,0.1121575867375192,0.1121575867375192,6.99289630301098E-2,0.2880316261714268,0.2880316261714268,0,0,0,0,0,0,0,0,0,0,3.5214472500077698E-2,0.14504550531657501,4.4012060135699499E-2,0.18128204255769942]
["Crawley College Car Park","N/A",null,null,0.36109727675999997,0.36,0,0,0,0,0,0,0,0,0,0,0,1,0,0,0,0,9.6905211556190599E-2,0.2683631746705134,0.129719683303015,0.35923750094972889,0.35923750094972889,0.193569527776179,0.53605922900613079,0.53605922900613079,0,0,0,0,0,0,0,0,0,0,0.143213213003825,0.39660563017485828,0.15537648798982701,0.43028983597983922]
["Zurich House","N/A",null,null,0.30616611043300002,0.31,0,0,0,0,0,0,0,0,0,0,0,1,0,0,0,0,8.4968970165080399E-2,0.27752571976340479,0.103148643002846,0.33690418203688999,0.33690418203688999,0.13779425830483699,0.45006371903787584,0.45006371903787584,0,0,0,0,0,0,0,0,0,0,0.110838721731808,0.36202152346336658,0.116424320082656,0.3802652093597203]
["138 - 144 London Road","N/A",null,null,0.27963510505799999,0.28000000000000003,0,0,0,0,0,0,0,0,0,0,0,1,0,0,0,0,0,0,0,0,0,0,0,0,0,0,0,0,0,0,0,0,0,0,0,0,0,0]
["8 - 9 Queens Square","N/A",null,null,4.1707624998200001E-2,0.04,0,0,0,0,0,0,0,0,0,0,0,1,0,0,0,0,0,0,0,0,0,7.97984499797818E-4,1.9132820433488049E-2,1.9132820433488049E-2,0,0,0,0,0,0,0,0,0,0,3.1031499980666699E-4,7.4402462336337644E-3,4.7509149975782201E-4,1.1390998643013737E-2]
["15 - 29 The Broadway","N/A",null,null,0.109998100365,0.11,0,0,0,0,0,0,0,0,0,0,0,1,0,0,0,0,1.40517868862052E-3,1.2774572324047424E-2,3.4833513091067302E-3,3.1667376959676009E-2,3.1667376959676009E-2,4.87131362926373E-3,4.4285434140221937E-2,4.4285434140221937E-2,0,0,0,0,0,0,0,0,0,0,3.4833513091067302E-3,3.1667376959676009E-2,3.9791524691669003E-3,3.6174738072413261E-2]
["Former EDF Building","N/A",null,null,0.33373833675199999,0.33,0,0,0,0,0,0,0,0,0,0,0,1,0,0,0,0,0,0,0,0,0,1.3599999999999999E-2,4.0750487739459551E-2,4.0750487739459551E-2,0,0,0,0,0,0,0,0,0,0,0,0,0,0]
["County Buildings","N/A",null,null,1.04831972717,1.05,0,0,0,0,0,0,0,0,0,0,0,1,0,0,0,0,0,0,0,0,0,2.6800000000000001E-2,2.5564719718046476E-2,2.5564719718046476E-2,0,0,0,0,0,0,0,0,0,0,0,0,0,0]
["Shaw House","N/A",null,null,0.19972388058400001,0.2,0,0,0,0,0,0,0,0,0,0,0,1,0,0,0,0,0,0,1.7965188259936099E-4,8.9950126181231936E-4,8.9950126181231936E-4,1.9029079591995799E-3,9.5276937021021562E-3,9.5276937021021562E-3,0,0,0,0,0,0,0,0,0,0,4.8370312811039299E-4,2.4218592523639493E-3,4.8370312811039299E-4,2.4218592523639493E-3]
["Oak Tree Filling Station, 114 London Road","N/A",null,null,0.19753521294699999,0.2,0,0,0,0,0,0,0,0,0,0,0,1,0,0,0,0,0,0,5.0423951010420204E-7,2.5526563217844753E-6,2.5526563217844753E-6,1.2902920933186301E-2,6.5319599177733639E-2,6.5319599177733639E-2,0,0,0,0,0,0,0,0,0,0,8.8353866340790406E-5,4.4728160120239592E-4,1.9275051904231301E-3,9.7577802036758511E-3]
["Oakhurst Grange","N/A",null,null,1.4849629619,1.48,0,0,0,0,0,0,0,0,0,0,0,1,0,0,0,0,0,0,0,0,0,7.1999999999999995E-2,4.8486057798961181E-2,4.8486057798961181E-2,0,0,0,0,0,0,0,0,0,0,0,0,2.1600000000000001E-2,1.4545817339688356E-2]
["Rear Gardens, Snell Hatch/Ifield Road","N/A",null,null,0.48713011504999998,0.49,0,0,0,0,0,0,0,0,0,0,0,1,0,0,0,0,0,0,7.0011524499659899E-3,1.4372243131072646E-2,1.4372243131072646E-2,3.6072127466246599E-2,7.4050292420422589E-2,7.4050292420422589E-2,0,0,0,0,0,0,0,0,0,0,9.3391977999635698E-3,1.9171875257609512E-2,1.0738992192091699E-2,2.2045428644848673E-2]
["Sutherland House (Eastern Section)","N/A",null,null,0.90864929973800002,0.91,0,0,0,0,0,0,0,0,0,0,0,1,0,0,0,0,0,0,0,0,0,7.2377151749934795E-2,7.9653560257850892E-2,7.9653560257850892E-2,0,0,0,0,0,0,0,0,0,0,1.5182000007480401E-4,1.670831641190719E-4,1.04680717498994E-2,1.1520475229461757E-2]
["Land to the southeast of Heathy Farm","N/A",null,null,2.2209722115399999,2.2200000000000002,0,0,0,0,0,0,0,0,0,0,0,1,0,0,0,0,0,0,1.007237007627E-6,4.5351175597491693E-7,4.5351175597491693E-7,1.67304437530808E-2,7.5329370021609042E-3,7.5329370021609042E-3,0,0,0,0,0,0,0,0,0,0,1.007237007627E-6,4.5351175597491693E-7,3.44747609000642E-3,1.552237381491583E-3]
["21, 25, 27 & 29 Tushmore Lane","N/A",null,null,0.60015344549600003,0.6,0,0,0,0,0,0,0,0.37882093435360198,0.38,0.63333333333333341,0.63333333333333341,0.36666666666666659,0,0,0,0,0,0,4.11556073720062E-2,6.8575141375707555E-2,6.8575141375707555E-2,0.350289334374282,0.58366628901844175,0.58366628901844175,0,0,0,0,0,0,0,0,3.2599025000119602E-2,5.4317816959591002E-2,9.0214864156429805E-2,0.15031966380176531,0.132301644155883,0.22044636275734716]
["Brittingham House","N/A",null,null,0.131032236054,0.13,0,0,0,0,0,0,0,0,0,0,0,1,0,0,0,0,0,0,0,0,0,6.9325375007792795E-4,5.2907114383076662E-3,5.2907114383076662E-3,0,0,0,0,0,0,0,0,0,0,0,0,0,0]
["Crawley College","N/A",null,null,3.41391614566,3.41,0,0,0,0,0,0,0,0,0,0,0,1,0,0,0,0,0.29150300474255703,8.5386691501821238E-2,0.66174892310746802,0.19383865768019165,0.19383865768019165,1.4776933750763901,0.43284407467211322,0.43284407467211322,0,0,0,0,0,0,0,0,0,0,0.86500591505906399,0.25337643871502752,1.0022525580746,0.29357855181906883]
["Telford Place","N/A",null,null,1.73808379902,1.74,0,0,0,0,0,0,0,0,0,0,0,1,0,0,0,0,4.2459158298091097E-2,2.4428717603852727E-2,0.114154537910264,6.5678385573025203E-2,6.5678385573025203E-2,0.34158385897819499,0.19652899311920025,0.19652899311920025,0,0,0,0,0,0,0,0,0,0,0.17111728227720499,9.8451687066922575E-2,0.21112353347211199,0.12146913376164702]
["Former TSB Site","N/A",null,null,0.49411884870200001,0.49,0,0,0,0,0,0,0,0,0,0,0,1,0,0,0,0,0,0,5.28E-2,0.10685688299221985,0.10685688299221985,0.18873396089944799,0.38196065864565359,0.38196065864565359,0,0,0,0,0,{"$f":"AI34/E34","v":0},0,{"$f":"AK34/E34","v":0},0,{"$f":"AM34/E34","v":0},7.0400000000000004E-2,{"$f":"AO34/E34","v":0.14247584398962648},8.2940080000087596E-2,{"$f":"AQ34/E34","v":0.16785451560482414}]
["7 - 13 The Broadway & 1 - 3 Queens Square","N/A",null,null,9.0799073520499998E-2,0.09,0,0,0,0,0,0,0,0,0,0,0,1,0,0,0,0,0,0,0,0,0,2.6166784944105801E-3,2.8818339141090509E-2,2.8818339141090509E-2,0,0,0,0,0,0,0,0,0,0,0,0,0,0]
["Breezehurst Drive Playing Fields","N/A",null,null,2.7372661915899998,2.74,1.2711912606706901E-2,0.01,3.6496350364963502E-3,1.2711912606706901E-2,0.01,3.6496350364963502E-3,0,1.2711912606706901E-2,0.01,3.6496350364963502E-3,0,0.9963503649635036,0,0,0,0,0,0,0,0,0,0,0,0,0,0,0,0,1.2711912606706901E-2,4.6440176866112222E-3,1.2711912606706901E-2,4.6440176866112222E-3,1.27117813327704E-2,4.6439697285657446E-3,0,0,0,0]
["Land to the southeast of Heathy Farm","N/A",null,null,2.10841042775,2.11,0,0,0,0,0,0,0,0,0,0,0,1,0,0,0,0,0,0,4.6847999999299601E-4,2.2219582763728627E-4,2.2219582763728627E-4,7.6820537098160599E-2,3.6435286074799011E-2,3.6435286074799011E-2,0,0,0,0,0,0,0,0,0,0,4.0727378188364204E-3,1.9316627186209952E-3,5.1527215376678103E-3,2.4438892304125821E-3]
["Land Adjacent to Desmond Anderson","N/A",null,null,3.5151634173400002,3.52,0.108476148361628,0.11,3.125E-2,0.64259990945382806,0.64,0.18181818181818182,0.15056818181818182,0.76469755468283995,0.76,0.21590909090909091,3.4090909090909088E-2,0.78409090909090906,0,0,0,0,5.6548475388552399E-2,1.6087011804231808E-2,0.119589753686743,3.402110783721092E-2,3.402110783721092E-2,0.52058386380303001,0.14809663221773259,0.14809663221773259,0,0,0,0,0.72607746446812105,0.20655582067292891,0.73811393064937103,0.20997997618213657,0.75406914209428699,0.21451894337956764,0.18700649401787101,5.3199943164913464E-2,0.22740600113571199,6.4692867482045835E-2]
["Henty Close","N/A",null,null,0.35182774594600003,0.35,4.09315729533479E-2,0.04,0.1142857142857143,4.09315729533479E-2,0.04,0.1142857142857143,0,4.09315729533479E-2,0.04,0.1142857142857143,0,0.88571428571428568,0,0,0,0,3.0553849781437799E-3,8.6843207033840165E-3,3.3238050866015302E-3,9.4472511758969726E-3,9.4472511758969726E-3,1.8536454079858E-2,5.2686163309880199E-2,5.2686163309880199E-2,0,0,0,0,4.09315729533479E-2,0.11633980953744974,4.09315729533479E-2,0.11633980953744974,4.09315771873697E-2,0.11633982157180987,4.1297077162986296E-3,1.1737868215011315E-2,5.3683505763465903E-3,1.5258462808020113E-2]
["257 - 259 Ifield Road","N/A",null,null,0.11551717782900001,0.12,0,0,0,0,0,0,0,0,0,0,0,1,0,0,0,0,5.7541322616545598E-2,0.49811918623673423,7.0757584644813201E-2,0.61252868166114305,0.61252868166114305,9.6791404011509402E-2,0.83789619717674935,0.83789619717674935,0,0,0,0,0,0,0,0,0,0,8.2759468767717698E-2,0.7164256461513151,8.7135065438920703E-2,0.75430396653133858]
["Tinsley Lane Playing Fields","N/A",null,null,5.9747306996200003,5.97,0,0,0,0,0,0,0,0,0,0,0,1,0,0,0,0,0,0,0,0,0,0,0,0,0,0,0,0,0,0,0,0,0,0,0,0,0,0]
["Stoner House","N/A",null,null,0.42345709074999999,0.42,0,0,0,0,0,0,0,0,0,0,0,1,0,0,0,0,5.2481374615491398E-2,0.12393551970647075,6.7250070994456096E-2,0.15881200826120798,0.15881200826120798,0.22909343205051,0.5410074292173368,0.5410074292173368,0,0,0,0,0,0,0,0,0,0,9.0631250849560294E-2,0.21402700020689239,0.108238309523326,0.25560632207532824]
["1 - 7 Pegler Way","N/A",null,null,0.124046057977,0.12,0,0,0,0,0,0,0,0,0,0,0,1,0,0,0,0,1.0800000000000001E-2,8.7064435389010777E-2,1.42297508494006E-2,0.11471344661382959,0.11471344661382959,2.0431494772427901E-2,0.16470894041805187,0.16470894041805187,0,0,0,0,0,0,0,0,0,0,1.47256996038896E-2,0.11871154830748402,1.55256996038896E-2,0.12516076574370705]
["Longley Building","N/A",null,null,0.48647243500199999,0.49,0,0,0,0,0,0,0,0,0,0,0,1,0,0,0,0,0,0,7.16308000013232E-3,1.472453418681959E-2,1.472453418681959E-2,2.4916760000213999E-2,5.1219263841971972E-2,5.1219263841971972E-2,0,0,0,0,0,0,0,0,0,0,1.0363080000132301E-2,2.1302501960033349E-2,1.19630800001323E-2,2.4591485846640247E-2]
["Land North of the Boulevard","N/A",null,null,1.2892385845300001,1.29,0,0,0,0,0,0,0,0,0,0,0,1,0,0,0,0,0,0,2.6997979999519899E-2,2.0941026993356843E-2,2.0941026993356843E-2,7.2805792617988599E-2,5.6471931178301182E-2,5.6471931178301182E-2,0,0,0,0,0,0,0,0,0,0,3.8322939999587802E-2,2.9725250593208602E-2,4.3142739999853102E-2,3.3463736283987383E-2]
["Crawley Station and Car Parks","N/A",null,null,2.0443354641,2.04,0,0,0,0,0,0,0,0,0,0,0,1,0,0,0,0,0.12739609492060899,6.2316629123632582E-2,0.389820570881732,0.19068326980931524,0.19068326980931524,0.99415519634865401,0.48629748581225229,0.48629748581225229,0,0,0,0,0,0,0,0,0,0,0.50392933547613705,0.24650031480913889,0.61192503255701902,0.29932711304130971]
["Ocean House","N/A",null,null,0.1675561975,0.17,0.161301018212195,0.16,0.94117647058823528,0.16755619750002099,0.17,1,5.8823529411764719E-2,0.16755619750002099,0.17,1,0,0,0,0.16755619750002099,1.0000000000001252,0,0,0,0,0,0,8.5709359802089796E-2,0.51152604965322035,0.51152604965322035,0,0,0,0,0.16755619750002099,1.0000000000001252,0.16755619750002099,1.0000000000001252,0.16755619750002099,1.0000000000001252,0,0,1.3875550919516901E-2,8.2811326149346998E-2]
["Land East of Balcombe Road/Street Hill","N/A",null,null,1.75450579751,1.75,2.3669007238005701E-2,0.02,1.1428571428571429E-2,2.46040847629167E-2,0.02,1.1428571428571429E-2,0,3.9176821428807997E-2,0.04,2.2857142857142857E-2,1.1428571428571429E-2,0.97714285714285709,0,0,0,0,7.7815387565272703E-2,4.4351741485099988E-2,0.100251905778758,5.7139683391776656E-2,5.7139683391776656E-2,0.18669431070428899,0.10640848891422652,0.10640848891422652,0,0,0,0,2.8018858473814301E-2,1.5969658529244389E-2,2.9177887858045801E-2,1.663026015613921E-2,3.6536180946012402E-2,2.0824200750926364E-2,0.119928842795508,6.8354771449436857E-2,0.13325813662451599,7.5951950009875341E-2]
["Rear Gardens, Dingle Close/Ifield Road","N/A",null,null,0.71629540150600002,0.72,0,0,0,0,0,0,0,0,0,0,0,1,0,0,0,0,0,0,6.1996824996707204E-4,8.6552035467992448E-4,8.6552035467992448E-4,1.04724905892536E-2,1.4620351557800525E-2,1.4620351557800525E-2,0,0,0,0,0,0,0,0,0,0,2.4348382499457602E-3,3.399209662419374E-3,3.9182812499925501E-3,5.4702029941200575E-3]
["The Imperial","N/A",null,null,0.104702495002,0.1,0,0,0,0,0,0,0,0,0,0,0,1,0,0,0,0,0,0,3.8980049991932499E-5,3.7229342043079212E-4,3.7229342043079212E-4,2.8581566250090101E-2,0.27297884591522048,0.27297884591522048,0,0,0,0,0,0,0,0,0,0,1.2824720050001501E-2,0.12248724397404785,1.9062839550127299E-2,0.18206671722353096]
["9 Woolborough Road","N/A",null,null,0.13908572911100001,0.14000000000000001,0,0,0,0,0,0,0,0,0,0,0,1,0,0,0,0,0,0,3.43984345190604E-5,2.4731821689346776E-4,2.4731821689346776E-4,7.3311160999826996E-3,5.2709333637903019E-2,5.2709333637903019E-2,0,0,0,0,0,0,0,0,0,0,6.7929947193798399E-4,4.884034302296076E-3,1.93436487123217E-3,1.3907716367424104E-2]
["Ambulance Station","N/A",null,null,0.43019915999699998,0.43,0,0,0,0,0,0,0,0,0,0,0,1,0,0,0,0,0,0,0,0,0,9.9286469504614004E-5,2.3079187208386548E-4,2.3079187208386548E-4,0,0,0,0,0,0,0,0,0,0,0,0,9.9564424975299093E-6,2.3143798090166754E-5]
["Fire Station","N/A",null,null,0.44543231154599999,0.45,0,0,0,0,0,0,0,0,0,0,0,1,0,0,0,0,7.1765853720058406E-2,0.16111506026802261,0.216911406840751,0.48696828051808372,0.48696828051808372,0.37663327119590001,0.84554546545733678,0.84554546545733678,0,0,0,0,0,0,0,0,0,0,0.28552515737694401,0.64100683757302523,0.33046727109117702,0.74190233291382934]
["Goffs Park Depot","N/A",null,null,0.93892169452499996,0.94,0,0,0,0,0,0,0,0,0,0,0,1,0,0,0,0,0,0,1.1599999999999999E-2,1.2354597904853432E-2,1.2354597904853432E-2,1.9599999999999999E-2,2.0875010253028216E-2,2.0875010253028216E-2,0,0,0,0,0,0,0,0,0,0,1.2800000000000001E-2,1.3632659757079651E-2,1.44E-2,1.5336742226714606E-2]
["Forge Wood","N/A",null,null,172.79160841699999,172.79,5.7123138304901397,5.71,3.3045893859598358E-2,17.660564954045501,17.66,0.10220498871462469,6.9159094855026332E-2,23.369119560260899,23.37,0.13525088257422305,3.3045893859598358E-2,0.86474911742577698,0,5.6140308369225904,3.2490182181614889E-2,0,3.5415075392291202,2.0495830623223084E-2,6.14191745150986,3.5545229932043343E-2,3.5545229932043343E-2,19.698055838207399,0.11399891475441246,0.11399891475441246,0,0,3.2019225000171E-2,1.8530543985040428E-4,19.603930949466701,0.11345418408373344,20.315352657421499,0.11757140779889162,21.718757261080299,0.12569335663955492,8.2185836458386508,4.756355775104916E-2,10.5843887080401,6.1255224168622079E-2]
["St. Catherine's Hospice","N/A",null,null,0.72920696769500004,0.73,0,0,0,0,0,0,0,0,0,0,0,1,0,0,0,0,1.1599999999999999E-2,1.5907692210713822E-2,1.6E-2,2.1941644428570793E-2,2.1941644428570793E-2,3.82716700000688E-2,5.2483960926819347E-2,5.2483960926819347E-2,0,0,0,0,0,0,0,0,0,0,1.6400000000000001E-2,2.2490185539285064E-2,1.6400000000000001E-2,2.2490185539285064E-2]
["Rushetts Road Play Area","N/A",null,null,0.41633629409900003,0.42,0,0,0,0,0,0,0,0,0,0,0,1,0,0,0,0,0,0,0,0,0,2.7134586434968001E-2,6.5174684070458927E-2,6.5174684070458927E-2,0,0,0,0,0,0,0,0,0,0,0,0,1.6407991203917199E-2,3.9410427187055584E-2]
["Land S/O and R/O 24 Brighton Road","N/A",null,null,0.26917773196200001,0.27,0,0,0,0,0,0,0,0,0,0,0,1,0,0,0,0,0,0,0,0,0,5.9484349993359795E-4,2.2098540454957558E-3,2.2098540454957558E-3,0,0,0,0,0,0,0,0,0,0,0,0,0,0]
["Moka","N/A",null,null,0.37878637395499998,0.38,0,0,0,0,0,0,0,0,0,0,0,1,0,0,0,0,0,0,1.1273257556554601E-4,2.9761518184637416E-4,2.9761518184637416E-4,3.52389260922318E-3,9.3031134473750103E-3,9.3031134473750103E-3,0,0,0,0,0,0,0,0,0,0,1.1273257556554601E-4,2.9761518184637416E-4,2.9559089869655297E-4,7.8036307275316434E-4]
["Kilnmead Car Park","N/A",null,null,0.50389553831199996,0.5,0,0,0,0,0,0,0,0,0,0,0,1,0,0,0,0,0,0,0,0,0,0,0,0,0,0,0,0,0,0,0,0,0,0,0,0,0,0]
["The Old Vicarage, Church Walk (Cross Keys)","N/A",null,null,0.24982290799000001,0.25,0,0,0,0,0,0,0,0,0,0,0,1,0,0,0,0,0,0,2.4900439999438799E-2,9.9672364715390802E-2,9.9672364715390802E-2,0.119270422608695,0.47741987941902109,0.47741987941902109,0,0,0,0,0,0,0,0,0,0,5.2127549739390502E-2,0.20865800562003337,7.3119504187857898E-2,0.29268534569609905]
["Harwood. Blaxley and Forest Way, Balcombe Road","N/A",null,null,0.730935094999,0.73,0,0,0,0,0,0,0,0,0,0,0,1,0,0,0,0,0,0,2.71213610002803E-2,3.7105019564449025E-2,3.7105019564449025E-2,0.122905468859864,0.1681482661056686,0.1681482661056686,0,0,0,0,0,0,0,0,0,0,4.7594970500469298E-2,6.5115180302752346E-2,8.1292233668022199E-2,0.11121676086456543]
["96 – 102 North Road","N/A",null,null,0.360545775003,0.36,0,0,0,0,0,0,0,0,0,0,0,1,0,0,0,0,0,0,7.5110085998639003E-3,2.0832330096785638E-2,2.0832330096785638E-2,2.0975494949937799E-2,5.8177064894917349E-2,5.8177064894917349E-2,0,0,0,0,0,0,0,0,0,0,9.9166630998844506E-3,2.7504588286471909E-2,1.10541940998882E-2,3.0659613470151524E-2]
["46 – 48 Goffs Park Road","N/A",null,null,0.27830506499800001,0.28000000000000003,0,0,0,0,0,0,0,0,0,0,0,1,0,0,0,0,0,0,0,0,0,0,0,0,0,0,0,0,0,0,0,0,0,0,0,0,0,0]
["40 Springfield Road","N/A",null,null,6.1910376274599999E-2,0.06,0,0,0,0,0,0,0,0,0,0,0,1,0,0,0,0,0,0,0,0,0,0,0,0,0,0,0,0,0,0,0,0,0,0,0,0,0,0]
["34-38 & 40, the Broadway","N/A",null,null,0.114929567522,0.11,0,0,0,0,0,0,{"$f":"L66-I66","v":0},0,0,0,0,1,0,0,{"$f":"T66/E66","v":0},0,0,{"$f":"W66/E66","v":0},0,{"$f":"Y66/E66","v":0},{"$f":"Y66/E66","v":0},4.2590236000594403E-2,{"$f":"AB66/E66","v":0.37057684039785249},{"$f":"AB66/E66","v":0.37057684039785249},0,0,0,0,0,{"$f":"AI66/E66","v":0},0,{"$f":"AK66/E66","v":0},0,{"$f":"AM66/E66","v":0},0,{"$f":"AO66/E66","v":0},0,{"$f":"AQ66/E66","v":0}]
["48 the Broadway","N/A",null,null,3.10037223066E-2,{"$f":"ROUND(E67,2)","v":0.03},0,{"$f":"ROUND(G67,2)","v":0},{"$f":"H67/F67","v":0},0,{"$f":"ROUND(J67,2)","v":0},{"$f":"K67/F67","v":0},0,0,{"$f":"ROUND(N67,2)","v":0},{"$f":"O67/F67","v":0},{"$f":"P67-L67","v":0},{"$f":"1-P67","v":1},0,0,0,0,0,0,0,0,0,2.74338074985887E-3,8.8485528373954805E-2,8.8485528373954805E-2,0,{"$f":"AE67/E67","v":0},0,{"$f":"AG67/E67","v":0},0,0,0,0,0,0,0,0,4.0135050005260699E-4,1.2945235932756642E-2]
["Land R/O the George Hotel","N/A",null,null,0.30702771079899999,0.31,0,0,0,0,0,0,0,0,0,0,0,1,0,0,0,0,0,0,1.715825664999E-2,5.5885042445640659E-2,5.5885042445640659E-2,3.30820269000082E-2,0.10774931947971893,0.10774931947971893,0,0,0,0,0,0,0,0,0,0,1.9158256649990001E-2,6.2399112445365633E-2,2.5482026900008201E-2,8.2995853480764048E-2]
["Belgrave House, Station Way","N/A",null,null,0.15269119499600001,0.15,0,0,0,0,0,0,0,0,0,0,0,1,0,0,0,0,0,0,0,0,0,0,0,0,0,0,0,0,0,0,0,0,0,0,0,0,0,0]
["Pacific House, Hazelwick Avenue","N/A",null,null,0.191143621372,0.19,0,0,0,4.6887259920442303E-6,0,0,0,8.9723179219677197E-3,0.01,5.2631578947368418E-2,5.2631578947368418E-2,0.94736842105263164,0,6.7717658614246307E-2,0.35427631917915542,0,1.1585200009867501E-3,6.0609922144985468E-3,1.5327000003308099E-3,8.0185778072494451E-3,8.0185778072494451E-3,2.4276784748807002E-2,0.12700808206181255,0.12700808206181255,0,0,0,0,1.8113820144273899E-4,9.4765496301972508E-4,1.15091765287556E-3,6.0212192518612302E-3,4.2026685029974203E-3,2.1986967039921611E-2,6.6569144992578199E-3,3.4826767702084406E-2,1.13194117484007E-2,5.9219406157274175E-2]
["Energy House, Hazelwick Avenue","N/A",null,null,0.43286810526899999,0.43,5.2703116551479703E-4,0,0,0.10902817596716299,0.11,0.2558139534883721,0.2558139534883721,0.17158781335322201,0.17,0.39534883720930236,0.13953488372093026,0.60465116279069764,0,0.405313666289219,0.93634449236527217,0,0,0,1.2500486257746899E-4,2.8878279793746048E-4,2.8878279793746048E-4,9.9762490246942698E-2,0.23046856313182662,0.23046856313182662,0,0,0,0,0.12277166043639801,0.28362371572768852,0.13948890574255199,0.32224343638316461,0.14724944772285101,0.34017162717808658,1.1050378858999101E-2,2.5528281535392848E-2,2.9547149692960201E-2,6.8259013157364712E-2]
["Land at Gales Place and West Way","N/A",null,null,0.77749154107100005,0.78,0,0,0,0,0,0,0,0,0,0,0,1,0,0,0,0,0,0,1.5208999998867501E-4,1.9561627613230359E-4,1.9561627613230359E-4,3.4288055536203003E-2,4.4100872774732659E-2,4.4100872774732659E-2,0,0,0,0,0,0,0,0,0,0,1.5088457249605501E-2,1.9406587020639538E-2,2.0250747249030199E-2,2.604626054340688E-2]
["Furnace Green Community Centre","N/A",null,null,0.25659350000800002,0.26,0,0,0,0,0,0,0,0,0,0,0,1,0,0,0,0,0,0,0,0,0,4.81451999992132E-3,1.8763218864746044E-2,1.8763218864746044E-2,0,0,0,0,0,0,0,0,0,0,2.2145227944528801E-5,8.630471131902547E-5,2.2145227944528801E-5,8.630471131902547E-5]
["Land at Peterborough Road","N/A",null,null,0.26097370576599999,0.26,0,0,0,0,0,0,0,0,0,0,0,1,0,0,0,0,0,0,0,0,0,0,0,0,0,0,0,0,0,0,0,0,0,0,0,0,0,0]
["Former Age Concern Building, Shackleton Road","N/A",null,null,0.147978603559,0.15,0,0,0,3.0735779764695802E-3,0,0,0,8.6076357975610807E-2,0.09,0.6,0.6,0.4,0,0,0,0,5.1592921230233998E-2,0.34865122382144642,9.3622580632935395E-2,0.63267647066021593,0.63267647066021593,0.112141909730173,0.75782516548388235,0.75782516548388235,0,0,0,0,3.6002763121649801E-2,0.24329708657708257,5.39817041789546E-2,0.36479398291815718,8.0063848778613098E-2,0.54105017112620024,0.10255155774767,0.69301612044731886,0.109726989252458,0.74150577592597133]

{"sheet":"Sites","index":5,"n_rows":75,"n_cols":3,"rows_kept":75,"cut":false,"hidden":true,"merged":[[1,0,71,0],[72,0,75,0],[6,5,7,5]]}
[null,null,"SHLAA ID"]
["Crawley "," Gatwick Airport"]
[null," Town Centre"]
[null," Area Action Plan"]
[null," Area Action Plan"]
[null," Land at Jersey Farm (Site A)"]
[null," Space Gatwick, Faraday Road"]
[null," Southways, London Road"]
[null," Gatwick Park (Site G1), Gatwick Road"]
[null," Gatwick Park (Site G2), BCL House, Gatwick Road\r\n"]
[null," Manor Royal"]
[null,"2 - 12 Friston Walk"]
[null,"Parkside Car Park"]
[null,"Crawley College Car Park"]
[null,"Zurich House"]
[null,"138 - 144 London Road"]
[null,"8 - 9 Queens Square"]
[null,"15 - 29 The Broadway"]
[null,"Former EDF Building"]
[null,"County Buildings"]
[null,"Shaw House"]
[null,"Oak Tree Filling Station, 114 London Road"]
[null,"Oakhurst Grange"]
[null,"Rear Gardens, Snell Hatch/Ifield Road"]
[null,"Sutherland House (Eastern Section)"]
[null,"Land to the southeast of Heathy Farm"]
[null,"21, 25, 27 & 29 Tushmore Lane"]
[null,"Brittingham House"]
[null,"Crawley College"]
[null,"Telford Place"]
[null,"Former TSB Site"]
[null,"7 - 13 The Broadway & 1 - 3 Queens Square"]
[null,"Breezehurst Drive Playing Fields"]
[null,"Land to the southeast of Heathy Farm"]
[null,"Land Adjacent to Desmond Anderson"]
[null,"Henty Close"]
[null,"257 - 259 Ifield Road"]
[null,"Tinsley Lane Playing Fields"]
[null,"Stoner House"]
[null,"1 - 7 Pegler Way"]
[null,"Longley Building"]
[null,"Land North of the Boulevard"]
[null,"Crawley Station and Car Parks"]
[null,"Ocean House"]
[null,"Land East of Balcombe Road/Street Hill"]
[null,"Rear Gardens, Dingle Close/Ifield Road"]
[null,"The Imperial"]
[null,"9 Woolborough Road"]
[null,"Ambulance Station"]
[null,"Fire Station"]
[null,"Goffs Park Depot"]
[null,"Forge Wood"]
[null,"St. Catherine's Hospice"]
[null,"Rushetts Road Play Area"]
[null,"Land S/O and R/O 24 Brighton Road"]
[null,"Moka"]
[null,"Kilnmead Car Park"]
[null,"The Old Vicarage, Church Walk (Cross Keys)"]
[null,"Harwood. Blaxley and Forest Way, Balcombe Road"]
[null,"96 – 102 North Road"]
[null,"46 – 48 Goffs Park Road"]
[null,"40 Springfield Road"]
[null,"34-38 & 40, the Broadway"]
[null,"48 the Broadway"]
[null,"Land R/O the George Hotel"]
[null,"Belgrave House, Station Way"]
[null,"Pacific House, Hazelwick Avenue"]
[null,"Energy House, Hazelwick Avenue"]
[null,"Land at Gales Place and West Way"]
[null,"Furnace Green Community Centre"]
[null,"Land at Peterborough Road"]
[null,"Former Age Concern Building, Shackleton Road"]
["Horsham "," Land West of Bewbush","SA289"]
[null,"Land West of Kilnwood Vale","SA291"]
[null,"Land off Rusper Road, Ifield","SA468"]